Target
Acetylcholinesterase
Ligand
BDBM50039210
Substrate
Meas. Tech.
ChEMBL_29232 (CHEMBL641566)
IC50
24±n/a nM
Citation
 Ishihara, YHirai, KMiyamoto, MGoto, G Central cholinergic agents. 6. Synthesis and evaluation of 3-[1-(phenylmethyl)-4-piperidinyl]-1-(2,3,4,5-tetrahydro-1H-1-benzazepi n-8-yl)-1-propanones and their analogs as central selective acetylcholinesterase inhibitors. J Med Chem 37:2292-9 (1994)  
Target
Name:
Acetylcholinesterase
Synonyms:
ACES_RAT Acetylcholinesterase and butyrylcholinesterase (AChE and BChE) Acetylcholinesterase, AChE | Ache
Type:
Enzyme
Mol. Mass.:
68193.62
Organism:
Rattus norvegicus (rat)
Description:
P37136
Residue:
614
  
Inhibitor
Name:
BDBM50039210
Synonyms:
3-[1-(3-Chloro-benzyl)-piperidin-4-yl]-1-(1-methyl-1,2,3,4-tetrahydro-quinolin-6-yl)-propan-1-one | CHEMBL305739
Type:
Small organic molecule
Emp. Form.:
C25H31ClN2O
Mol. Mass.:
410.979
SMILES:
CN1CCCc2cc(ccc12)C(=O)CCC1CCN(Cc2cccc(Cl)c2)CC1
: