Target
Sodium- and chloride-dependent GABA transporter 2
Ligand
BDBM24183
Substrate
Meas. Tech.
ChEMBL_202727 (CHEMBL809055)
IC50
5000±n/a nM
Citation
 Dhar, TGBorden, LATyagarajan, SSmith, KEBranchek, TAWeinshank, RLGluchowski, C Design, synthesis and evaluation of substituted triarylnipecotic acid derivatives as GABA uptake inhibitors: identification of a ligand with moderate affinity and selectivity for the cloned human GABA transporter GAT-3. J Med Chem 37:2334-42 (1994)  
Target
Name:
Sodium- and chloride-dependent GABA transporter 2
Synonyms:
GABA transporter Gabt2 S6A13_RAT | Slc6a13
Type:
PROTEIN
Mol. Mass.:
68261.89
Organism:
Rattus norvegicus
Description:
ChEMBL_70051
Residue:
602
  
Inhibitor
Name:
BDBM24183
Synonyms:
4-amino-n-[2,3-3H]butyric acid Aminalon GABA [3H]GABA | cid_119
Type:
Radiolabeled ligand
Emp. Form.:
C4H9NO2
Mol. Mass.:
103.1198
SMILES:
NCCCC(O)=O
: