Target
Vesicular acetylcholine transporter
Ligand
BDBM50039605
Substrate
Meas. Tech.
ChEMBL_213554 (CHEMBL816914)
Ki
0.212±n/a nM
Citation
 Efange, SMKhare, ABFoulon, CAkella, SKParsons, SM Spirovesamicols: conformationally restricted analogs of 2-(4-phenylpiperidino)cyclohexanol (vesamicol, AH5183) as potential modulators of presynaptic cholinergic function. J Med Chem 37:2574-82 (1994)  
Target
Name:
Vesicular acetylcholine transporter
Synonyms:
TorVAChT VAChT
Type:
PROTEIN
Mol. Mass.:
56111.93
Organism:
Torpedo californica
Description:
ChEMBL_1503355
Residue:
515
  
Inhibitor
Name:
BDBM50039605
Synonyms:
(2R,3R)-3-{4-bromospiro[indene-1,4'-piperidine]-1'-yl}-1,2,3,4-tetrahydronaphthalen-2-ol | CHEMBL314848
Type:
Small organic molecule
Emp. Form.:
C23H24BrNO
Mol. Mass.:
410.347
SMILES:
O[C@@H]1Cc2ccccc2C[C@H]1N1CCC2(CC1)C=Cc1c2cccc1Br
: