Target
Vesicular acetylcholine transporter
Ligand
BDBM50039610
Substrate
Meas. Tech.
ChEMBL_213554 (CHEMBL816914)
Ki
0.121±n/a nM
Citation
 Efange, SMKhare, ABFoulon, CAkella, SKParsons, SM Spirovesamicols: conformationally restricted analogs of 2-(4-phenylpiperidino)cyclohexanol (vesamicol, AH5183) as potential modulators of presynaptic cholinergic function. J Med Chem 37:2574-82 (1994)  
Target
Name:
Vesicular acetylcholine transporter
Synonyms:
TorVAChT VAChT
Type:
PROTEIN
Mol. Mass.:
56111.93
Organism:
Torpedo californica
Description:
ChEMBL_1503355
Residue:
515
  
Inhibitor
Name:
BDBM50039610
Synonyms:
3-spiro[1H-indene-1,4'-(hexahydropyridine)]-1-yl-(2R,3R)-1,2,3,4-tetrahydro-2-naphthalenol trans-3-(1'H-spiro[indene-1,4'-piperidin]-1'-yl)-1,2,3,4-tetrahydronaphthalen-2-ol
Type:
Small organic molecule
Emp. Form.:
C23H25NO
Mol. Mass.:
331.4507
SMILES:
O[C@@H]1Cc2ccccc2C[C@H]1N1CCC2(CC1)C=Cc1ccccc21
: