Target
Vesicular acetylcholine transporter
Ligand
BDBM50039612
Substrate
Meas. Tech.
ChEMBL_213554 (CHEMBL816914)
Ki
24.25±n/a nM
Citation
 Efange, SMKhare, ABFoulon, CAkella, SKParsons, SM Spirovesamicols: conformationally restricted analogs of 2-(4-phenylpiperidino)cyclohexanol (vesamicol, AH5183) as potential modulators of presynaptic cholinergic function. J Med Chem 37:2574-82 (1994)  
Target
Name:
Vesicular acetylcholine transporter
Synonyms:
TorVAChT VAChT
Type:
PROTEIN
Mol. Mass.:
56111.93
Organism:
Torpedo californica
Description:
ChEMBL_1503355
Residue:
515
  
Inhibitor
Name:
BDBM50039612
Synonyms:
(1R,2R)-2-{3,4-dihydro-2H-spiro[naphthalene-1,4'-piperidine]-1'-yl}cyclohexan-1-ol CHEMBL87652
Type:
Small organic molecule
Emp. Form.:
C20H29NO
Mol. Mass.:
299.4504
SMILES:
O[C@@H]1CCCC[C@H]1N1CCC2(CCCc3ccccc23)CC1
: