Target
Vesicular acetylcholine transporter
Ligand
BDBM50039619
Substrate
Meas. Tech.
ChEMBL_213554 (CHEMBL816914)
Ki
0.856±n/a nM
Citation
 Efange, SMKhare, ABFoulon, CAkella, SKParsons, SM Spirovesamicols: conformationally restricted analogs of 2-(4-phenylpiperidino)cyclohexanol (vesamicol, AH5183) as potential modulators of presynaptic cholinergic function. J Med Chem 37:2574-82 (1994)  
Target
Name:
Vesicular acetylcholine transporter
Synonyms:
TorVAChT VAChT
Type:
PROTEIN
Mol. Mass.:
56111.93
Organism:
Torpedo californica
Description:
ChEMBL_1503355
Residue:
515
  
Inhibitor
Name:
BDBM50039619
Synonyms:
1-(3-iodobenzyl)-3-spiro[1,2,3,4-tetrahydronaphthalene-1,4'-(hexahydropyridine)]-1-yl-(3R,4R)-hexahydro-4-pyridinol | CHEMBL315226
Type:
Small organic molecule
Emp. Form.:
C26H33IN2O
Mol. Mass.:
516.4575
SMILES:
O[C@@H]1CCN(Cc2cccc(I)c2)C[C@H]1N1CCC2(CCCc3ccccc23)CC1
: