Target
D(4) dopamine receptor
Ligand
BDBM50028602
Substrate
Meas. Tech.
ChEMBL_61349 (CHEMBL673252)
Ki
0.9±n/a nM
Citation
 Phillips, STde Paulis, TBaron, BMSiegel, BWSeeman, PVan Tol, HHGuan, HCSmith, HE Binding of 5H-dibenzo[b,e][1,4]diazepine and chiral 5H-dibenzo[a,d]cycloheptene analogues of clozapine to dopamine and serotonin receptors. J Med Chem 37:2686-96 (1994)  
Target
Name:
D(4) dopamine receptor
Synonyms:
D(2C) dopamine receptor DOPAMINE D4.2 DRD4 Dopamine D4 receptor
Type:
Enzyme
Mol. Mass.:
48373.19
Organism:
Homo sapiens (Human)
Description:
P21917
Residue:
419
  
Inhibitor
Name:
BDBM50028602
Synonyms:
1-(2-Chloro-dibenzo[b,f]oxepin-10-yl)-4-methyl-piperazine | CHEMBL88464
Type:
Small organic molecule
Emp. Form.:
C19H19ClN2O
Mol. Mass.:
326.82
SMILES:
CN1CCN(CC1)C1=Cc2cc(Cl)ccc2Oc2ccccc12
: