Target
D(2) dopamine receptor
Ligand
BDBM50028601
Substrate
Meas. Tech.
ChEMBL_61344 (CHEMBL675960)
Ki
1±n/a nM
Citation
 Phillips, STde Paulis, TBaron, BMSiegel, BWSeeman, PVan Tol, HHGuan, HCSmith, HE Binding of 5H-dibenzo[b,e][1,4]diazepine and chiral 5H-dibenzo[a,d]cycloheptene analogues of clozapine to dopamine and serotonin receptors. J Med Chem 37:2686-96 (1994)  
Target
Name:
D(2) dopamine receptor
Synonyms:
D(2) dopamine receptor DOPAMINE D2 Long DRD2 Dopamine D2 receptor Dopamine D2 receptor (D2R) Dopamine2-like | d2
Type:
Cell-surface receptors
Mol. Mass.:
50647.10
Organism:
Homo sapiens (Human)
Description:
P14416
Residue:
443
  
Inhibitor
Name:
BDBM50028601
Synonyms:
1-(8-Chloro-5H-dibenzo[a,d]cyclohepten-10-yl)-4-methyl-piperazine | CHEMBL7617
Type:
Small organic molecule
Emp. Form.:
C20H21ClN2
Mol. Mass.:
324.847
SMILES:
CN1CCN(CC1)C1=Cc2ccccc2Cc2ccc(Cl)cc12
: