Target
Adenosine receptor A1
Ligand
BDBM50039695
Substrate
Meas. Tech.
ChEMBL_29595 (CHEMBL640253)
IC50
9±n/a nM
Citation
 Scammells, PJBaker, SPBelardinelli, LOlsson, RA Substituted 1,3-dipropylxanthines as irreversible antagonists of A1 adenosine receptors. J Med Chem 37:2704-12 (1994)  
Target
Name:
Adenosine receptor A1
Synonyms:
A1 adenosine receptor (hA1) AA1R_HUMAN ADORA1 Adenosine A1-receptor Adenosine receptor A1 (hA1) | Adenosine transporter (AdT)
Type:
G Protein-Coupled Receptor (GPCR)
Mol. Mass.:
36520.92
Organism:
Homo sapiens (Human)
Description:
P30542
Residue:
326
  
Inhibitor
Name:
BDBM50039695
Synonyms:
Bromo-acetic acid 3-(8-cyclopentyl-2,6-dioxo-1-propyl-octahydro-purin-3-yl)-propyl ester | CHEMBL329774
Type:
Small organic molecule
Emp. Form.:
C18H29BrN4O4
Mol. Mass.:
445.351
SMILES:
CCCN1C(=O)C2NC(NC2N(CCCOC(=O)CBr)C1=O)C1CCCC1
: