Target
Adenosine receptor A1
Ligand
BDBM50039701
Substrate
Meas. Tech.
ChEMBL_29595 (CHEMBL640253)
IC50
20±n/a nM
Citation
 Scammells, PJBaker, SPBelardinelli, LOlsson, RA Substituted 1,3-dipropylxanthines as irreversible antagonists of A1 adenosine receptors. J Med Chem 37:2704-12 (1994)  
Target
Name:
Adenosine receptor A1
Synonyms:
A1 adenosine receptor (hA1) AA1R_HUMAN ADORA1 Adenosine A1-receptor Adenosine receptor A1 (hA1) | Adenosine transporter (AdT)
Type:
G Protein-Coupled Receptor (GPCR)
Mol. Mass.:
36520.92
Organism:
Homo sapiens (Human)
Description:
P30542
Residue:
326
  
Inhibitor
Name:
BDBM50039701
Synonyms:
3-Fluorosulfonyl-benzoic acid 3-(8-cyclopentyl-2,6-dioxo-1-propyl-1,2,6,7-tetrahydro-purin-3-yl)-propyl ester | CHEMBL90627
Type:
Small organic molecule
Emp. Form.:
C23H27FN4O6S
Mol. Mass.:
506.547
SMILES:
CCCn1c(=O)n(CCCOC(=O)c2cccc(c2)S(F)(=O)=O)c2nc([nH]c2c1=O)C1CCCC1
: