Target
Adenosine receptor A1
Ligand
BDBM50039702
Substrate
Meas. Tech.
ChEMBL_29595 (CHEMBL640253)
IC50
90±n/a nM
Citation
 Scammells, PJBaker, SPBelardinelli, LOlsson, RA Substituted 1,3-dipropylxanthines as irreversible antagonists of A1 adenosine receptors. J Med Chem 37:2704-12 (1994)  
Target
Name:
Adenosine receptor A1
Synonyms:
A1 adenosine receptor (hA1) AA1R_HUMAN ADORA1 Adenosine A1-receptor Adenosine receptor A1 (hA1) | Adenosine transporter (AdT)
Type:
G Protein-Coupled Receptor (GPCR)
Mol. Mass.:
36520.92
Organism:
Homo sapiens (Human)
Description:
P30542
Residue:
326
  
Inhibitor
Name:
BDBM50039702
Synonyms:
8-[Bis-(2-chloro-ethyl)-amino]-1,3-dipropyl-3,7-dihydro-purine-2,6-dione | CHEMBL90024
Type:
Small organic molecule
Emp. Form.:
C15H23Cl2N5O2
Mol. Mass.:
376.281
SMILES:
CCCn1c2nc([nH]c2c(=O)n(CCC)c1=O)N(CCCl)CCCl
: