Target
Type-1 angiotensin II receptor
Ligand
BDBM50039864
Substrate
Meas. Tech.
ChEMBL_36630 (CHEMBL652869)
IC50
0.420000±n/a nM
Citation
 Ashton, WTChang, LLFlanagan, KLHutchins, SMNaylor, EMChakravarty, PKPatchett, AAGreenlee, WJChen, TBFaust, KA Triazolinone biphenylsulfonamide derivatives as orally active angiotensin II antagonists with potent AT1 receptor affinity and enhanced AT2 affinity. J Med Chem 37:2808-24 (1994)  
Target
Name:
Type-1 angiotensin II receptor
Synonyms:
AGTR1 ANGIOTENSIN AT1 Angiotensin II type 1a (AT-1a) receptor
Type:
Enzyme Catalytic Domain
Mol. Mass.:
41009.15
Organism:
RABBIT
Description:
ANGIOTENSIN AT1 AGTR1 RABBIT::P34976
Residue:
359
  
Inhibitor
Name:
BDBM50039864
Synonyms:
2-{4-[3-butyl-5-oxo-1-(2-trifluoromethylphenyl)-4,5-dihydro-1H-1,2,4-triazol-4-ylmethyl]phenyl}-1-(N-isobutoxycarbonyl)benzenesulfonamide | CHEMBL97068
Type:
Small organic molecule
Emp. Form.:
C31H33F3N4O5S
Mol. Mass.:
630.678
SMILES:
CCCCc1nn(-c2ccccc2C(F)(F)F)c(=O)n1Cc1ccc(cc1)-c1ccccc1S(=O)(=O)NC(=O)OCC(C)C
: