Target
Calpain-1 catalytic subunit
Ligand
BDBM50040002
Substrate
Meas. Tech.
ChEMBL_43688 (CHEMBL653666)
Ki
244±n/a nM
Citation
 Harbeson, SLAbelleira, SMAkiyama, ABarrett, RCarroll, RMStraub, JATkacz, JNWu, CMusso, GF Stereospecific synthesis of peptidyl alpha-keto amides as inhibitors of calpain. J Med Chem 37:2918-29 (1994)  
Target
Name:
Calpain-1 catalytic subunit
Synonyms:
CAN1_HUMAN CAPN1 Calpain-1 (u-Calpain) Calpain1
Type:
Protein
Mol. Mass.:
81880.51
Organism:
Homo sapiens (Human)
Description:
Residue:
714
  
Inhibitor
Name:
BDBM50040002
Synonyms:
(S)-2-((R)-2-Amino-3-phenyl-propionylamino)-4-methyl-pentanoic acid ((S)-1-ethylcarbamoyl-butyl)-amide | CHEMBL101953
Type:
Small organic molecule
Emp. Form.:
C22H36N4O3
Mol. Mass.:
404.5462
SMILES:
CCC[C@H](NC(=O)[C@H](CC(C)C)NC(=O)[C@H](N)Cc1ccccc1)C(=O)NCC
: