Target
Adenosine receptor A1
Ligand
BDBM50040055
Substrate
Meas. Tech.
ChEMBL_29109 (CHEMBL638721)
Ki
110000±n/a nM
Citation
 Franchetti, PMessini, LCappellacci, LGrifantini, MLucacchini, AMartini, CSenatore, G 8-Azaxanthine derivatives as antagonists of adenosine receptors. J Med Chem 37:2970-5 (1994)  
Target
Name:
Adenosine receptor A1
Synonyms:
AA1R_BOVIN ADENOSINE A1 high ADORA1 | Adenosine A1 receptor
Type:
Enzyme Catalytic Domain
Mol. Mass.:
36602.99
Organism:
BOVINE
Description:
ADENOSINE 0 BOVINE::P28190
Residue:
326
  
Inhibitor
Name:
BDBM50040055
Synonyms:
2-Cyclopentyl-4,6-dimethyl-2,4-dihydro-[1,2,3]triazolo[4,5-d]pyrimidine-5,7-dione | CHEMBL101525
Type:
Small organic molecule
Emp. Form.:
C11H15N5O2
Mol. Mass.:
249.2691
SMILES:
Cn1c2nn(nc2c(=O)n(C)c1=O)C1CCCC1
: