Target
Beta-1 adrenergic receptor
Ligand
BDBM50040070
Substrate
Meas. Tech.
ChEBML_216051
Ki
24±n/a nM
Citation
 Cecchetti, VFravolini, ASchiaffella, FTabarrini, OBruni, GSegre, G o-Chlorobenzenesulfonamidic derivatives of (aryloxy)propanolamines as beta-blocking/diuretic agents. J Med Chem 36:157-61 (1993)  
Target
Name:
Beta-1 adrenergic receptor
Synonyms:
ADRB1 ADRB1_HUMAN Beta-1 adrenoceptor | adrenergic Beta1
Type:
G Protein-Coupled Receptor (GPCR)
Mol. Mass.:
51338.40
Organism:
Homo sapiens (Human)
Description:
P08588
Residue:
477
  
Inhibitor
Name:
BDBM50040070
Synonyms:
8-tert-Butylamino-2-(3-hydroxy-propoxy)-4H-benzo[1,4]thiazin-3-one | CHEMBL446609
Type:
Small organic molecule
Emp. Form.:
C15H22N2O3S
Mol. Mass.:
310.412
SMILES:
CC(C)(C)Nc1cccc2NC(=O)C(OCCCO)Sc12
: