Target
Beta-1 adrenergic receptor
Ligand
BDBM50040069
Substrate
Meas. Tech.
ChEBML_216051
Ki
7.8±n/a nM
Citation
 Cecchetti, VFravolini, ASchiaffella, FTabarrini, OBruni, GSegre, G o-Chlorobenzenesulfonamidic derivatives of (aryloxy)propanolamines as beta-blocking/diuretic agents. J Med Chem 36:157-61 (1993)  
Target
Name:
Beta-1 adrenergic receptor
Synonyms:
ADRB1 ADRB1_HUMAN Beta-1 adrenoceptor | adrenergic Beta1
Type:
G Protein-Coupled Receptor (GPCR)
Mol. Mass.:
51338.40
Organism:
Homo sapiens (Human)
Description:
P08588
Residue:
477
  
Inhibitor
Name:
BDBM50040069
Synonyms:
2-Chloro-5-{2-[2-hydroxy-3-(3-oxo-3,4-dihydro-2H-benzo[1,4]thiazin-8-yloxy)-propylamino]-ethylamino}-benzenesulfonamide | CHEMBL43968
Type:
Small organic molecule
Emp. Form.:
C19H23ClN4O5S2
Mol. Mass.:
486.993
SMILES:
NS(=O)(=O)c1cc(NCCNCC(O)COc2cccc3NC(=O)CSc23)ccc1Cl
: