Target
D(2) dopamine receptor
Ligand
BDBM50007521
Substrate
Meas. Tech.
ChEBML_62557
Ki
0.147000±n/a nM
Citation
 Chumpradit, SKung, MPBillings, JMach, RKung, HF Fluorinated and iodinated dopamine agents: D2 imaging agents for PET and SPECT. J Med Chem 36:221-8 (1993)  
Target
Name:
D(2) dopamine receptor
Synonyms:
DOPAMINE D2 DOPAMINE D2 Short Dopamine D2 receptor Drd2
Type:
G Protein-Coupled Receptor (GPCR)
Mol. Mass.:
50931.60
Organism:
Rattus norvegicus (rat)
Description:
P61169
Residue:
444
  
Inhibitor
Name:
BDBM50007521
Synonyms:
5-Bromo-N-[1-(4-fluoro-benzyl)-pyrrolidin-2-ylmethyl]-2,3-dimethoxy-benzamide (NCQ115) CHEMBL73683
Type:
Small organic molecule
Emp. Form.:
C21H24BrFN2O3
Mol. Mass.:
451.329
SMILES:
COc1cc(Br)cc(C(=O)NC[C@@H]2CCCN2Cc2ccc(F)cc2)c1OC
: