Target
D(2) dopamine receptor
Ligand
BDBM50040082
Substrate
Meas. Tech.
ChEBML_62557
Ki
1.5±n/a nM
Citation
 Chumpradit, SKung, MPBillings, JMach, RKung, HF Fluorinated and iodinated dopamine agents: D2 imaging agents for PET and SPECT. J Med Chem 36:221-8 (1993)  
Target
Name:
D(2) dopamine receptor
Synonyms:
DOPAMINE D2 DOPAMINE D2 Short Dopamine D2 receptor Drd2
Type:
G Protein-Coupled Receptor (GPCR)
Mol. Mass.:
50931.60
Organism:
Rattus norvegicus (rat)
Description:
P61169
Residue:
444
  
Inhibitor
Name:
BDBM50040082
Synonyms:
CHEMBL307023 N-(1-Ethyl-pyrrolidin-2-ylmethyl)-2-methoxy-5-sulfamoyl-benzamide(iodosulpiride)
Type:
Small organic molecule
Emp. Form.:
C15H22IN3O4S
Mol. Mass.:
467.322
SMILES:
CCN1CCC[C@H]1CNC(=O)c1c(I)c(ccc1OC)S(N)(=O)=O
: