Target
Mu-type opioid receptor
Ligand
BDBM50040131
Substrate
Meas. Tech.
ChEMBL_223426 (CHEMBL844036)
IC50
0.674000±n/a nM
Citation
 Kawasaki, AMKnapp, RJKramer, THWalton, AWire, WSHashimoto, SYamamura, HIPorreca, FBurks, TFHruby, VJ Design and synthesis of highly potent and selective cyclic dynorphin A analogs. 2. New analogs. J Med Chem 36:750-7 (1993)  
Target
Name:
Mu-type opioid receptor
Synonyms:
M-OR-1 Mu opioid receptor OPIATE Mu OPRM_CAVPO
Type:
Enzyme Catalytic Domain
Mol. Mass.:
11165.58
Organism:
GUINEA PIG
Description:
P97266
Residue:
98
  
Inhibitor
Name:
BDBM50040131
Synonyms:
CHEMBL409793 | Tyr-Gly-Gly-Phe-Leu-Arg-Arg-c((D-Cys)-Arg-Pro-Lys-(D-Cys))-Lys
Type:
Small organic molecule
Emp. Form.:
C69H112N24O15S2
Mol. Mass.:
1581.909
SMILES:
CC(C)C[C@H](NC(=O)[C@H](Cc1ccccc1)NC(=O)CNC(=O)CNC(=O)[C@@H](N)Cc1ccc(O)cc1)C(=O)N[C@@H](CCCNC(N)=N)C(=O)N[C@@H](CCCNC(N)=N)C(=O)N[C@@H]1CSSC[C@H](NC(=O)[C@@H](CCCCN)NC(=O)[C@@H]2CCCN2C(=O)[C@@H](CCCNC(N)=N)NC1=O)C(=O)N[C@@H](CCCCN)C(O)=O
: