Target
Kappa-type opioid receptor
Ligand
BDBM50040128
Substrate
Meas. Tech.
ChEMBL_223427 (CHEMBL845230)
IC50
81±n/a nM
Citation
 Kawasaki, AMKnapp, RJKramer, THWalton, AWire, WSHashimoto, SYamamura, HIPorreca, FBurks, TFHruby, VJ Design and synthesis of highly potent and selective cyclic dynorphin A analogs. 2. New analogs. J Med Chem 36:750-7 (1993)  
Target
Name:
Kappa-type opioid receptor
Synonyms:
Kappa Opioid Receptor OPRK1 Opiate Kappa 1 | mu/kappa opioid receptor
Type:
G Protein-Coupled Receptor (GPCR)
Mol. Mass.:
42744.99
Organism:
Cavia porcellus (domestic guinea pig)
Description:
P41144
Residue:
380
  
Inhibitor
Name:
BDBM50040128
Synonyms:
CHEMBL384566 | Tyr-(D-ala)-Gly-Phe-c(Cys-Arg-Arg-Ile-Arg-Pro-Cys)
Type:
Small organic molecule
Emp. Form.:
C58H90N20O13S2
Mol. Mass.:
1339.591
SMILES:
CC[C@H](C)[C@H]1NC(=O)[C@H](CCCNC(N)=N)NC(=O)[C@@H](CCCNC(N)=N)NC(=O)[C@@H](CSSC[C@@H](NC(=O)[C@H]2CCCN2C(=O)[C@H](CCCNC(N)=N)NC1=O)C(O)=O)NC(=O)[C@H](Cc1ccccc1)NC(=O)CNC(=O)[C@@H](C)NC(=O)[C@@H](N)Cc1ccc(O)cc1
: