Target
5-hydroxytryptamine receptor 1A
Ligand
BDBM50034360
Substrate
Meas. Tech.
ChEMBL_580 (CHEMBL615450)
Ki
0.300000±n/a nM
Citation
 Lin, CHHaadsma-Svensson, SRLahti, RAMcCall, RBPiercey, MFSchreur, PJVon Voigtlander, PFSmith, MWChidester, CG Centrally acting serotonergic and dopaminergic agents. 1. Synthesis and structure-activity relationships of 2,3,3a,4,5,9b-hexahydro-1H-benz[e]indole derivatives. J Med Chem 36:1053-68 (1993)  
Target
Name:
5-hydroxytryptamine receptor 1A
Synonyms:
5-HT-1A 5-hydroxytryptamine receptor 1A (5-HT-1A) ADRB2RL1 Dopamine D2 receptor and serotonin 1a receptor HTR1A | Serotonin receptor 1A
Type:
Mol. Mass.:
46122.49
Organism:
Homo sapiens (Human)
Description:
Residue:
422
  
Inhibitor
Name:
BDBM50034360
Synonyms:
(3aR,9bS)-3-Allyl-2,3,3a,4,5,9b-hexahydro-1H-benzo[e]indol-9-ol CHEMBL287134
Type:
Small organic molecule
Emp. Form.:
C15H19NO
Mol. Mass.:
229.3175
SMILES:
Oc1cccc2CC[C@@H]3[C@@H](CCN3CC=C)c12
: