Target
5-hydroxytryptamine receptor 1A
Ligand
BDBM50040158
Substrate
Meas. Tech.
ChEMBL_578 (CHEMBL615448)
Ki
16±n/a nM
Citation
 Lin, CHHaadsma-Svensson, SRLahti, RAMcCall, RBPiercey, MFSchreur, PJVon Voigtlander, PFSmith, MWChidester, CG Centrally acting serotonergic and dopaminergic agents. 1. Synthesis and structure-activity relationships of 2,3,3a,4,5,9b-hexahydro-1H-benz[e]indole derivatives. J Med Chem 36:1053-68 (1993)  
Target
Name:
5-hydroxytryptamine receptor 1A
Synonyms:
5-HT-1A 5-hydroxytryptamine receptor 1A (5-HT-1A) ADRB2RL1 Dopamine D2 receptor and serotonin 1a receptor HTR1A | Serotonin receptor 1A
Type:
Mol. Mass.:
46122.49
Organism:
Homo sapiens (Human)
Description:
Residue:
422
  
Inhibitor
Name:
BDBM50040158
Synonyms:
9-Methoxy-2-methyl-3-propyl-2,3,3a,4,5,9b-hexahydro-1H-benzo[e]indole | CHEMBL10561
Type:
Small organic molecule
Emp. Form.:
C17H25NO
Mol. Mass.:
259.3865
SMILES:
CCCN1[C@H](C)CC2[C@H]1CCc1cccc(OC)c21
: