Target
Kappa-type opioid receptor
Ligand
BDBM50040187
Substrate
Meas. Tech.
ChEMBL_146658 (CHEMBL753555)
Ki
50±n/a nM
Citation
 Snyder, KRMurray, TFDeLander, GEAldrich, JV Synthesis and opioid activity of dynorphin A-(1-13)NH2 analogues containing cis- and trans-4-aminocyclohexanecarboxylic acid. J Med Chem 36:1100-3 (1993)  
Target
Name:
Kappa-type opioid receptor
Synonyms:
Kappa Opioid Receptor OPRK1 Opiate Kappa 1 | mu/kappa opioid receptor
Type:
G Protein-Coupled Receptor (GPCR)
Mol. Mass.:
42744.99
Organism:
Cavia porcellus (domestic guinea pig)
Description:
P41144
Residue:
380
  
Inhibitor
Name:
BDBM50040187
Synonyms:
CHEMBL404976 | Tyr-Aib-Gly-Phe-Leu-Arg-Arg-Ile-Arg-Pro-Lys-Leu-Lys-NH2
Type:
Small organic molecule
Emp. Form.:
C77H131N25O14
Mol. Mass.:
1631.0231
SMILES:
CC[C@H](C)[C@H](NC(=O)[C@H](CCCNC(N)=N)NC(=O)[C@H](CCCNC(N)=N)NC(=O)[C@H](CC(C)C)NC(=O)[C@H](Cc1ccccc1)NC(=O)CNC(=O)C(C)(C)NC(=O)[C@@H](N)Cc1ccc(O)cc1)C(=O)N[C@@H](CCCNC(N)=N)C(=O)N1CCC[C@H]1C(=O)N[C@@H](CCCCN)C(=O)N[C@@H](CC(C)C)C(=O)N[C@@H](CCCCN)C(N)=O
: