Target
Delta-type opioid receptor
Ligand
BDBM50040188
Substrate
Meas. Tech.
ChEMBL_147052 (CHEMBL753279)
Ki
1370±n/a nM
Citation
 Snyder, KRMurray, TFDeLander, GEAldrich, JV Synthesis and opioid activity of dynorphin A-(1-13)NH2 analogues containing cis- and trans-4-aminocyclohexanecarboxylic acid. J Med Chem 36:1100-3 (1993)  
Target
Name:
Delta-type opioid receptor
Synonyms:
Cytochrome P450 3A4 Delta opioid receptor Delta-type opioid receptor (DOR) OPRD_RAT Opioid receptor Opioid receptors; mu & delta Ror-a | Voltage-gated potassium channel
Type:
G Protein-Coupled Receptor (GPCR)
Mol. Mass.:
40465.04
Organism:
Rattus norvegicus (rat)
Description:
Competition binding assays were using CHO-K1 cell membranes expressing the opioid receptor.
Residue:
372
  
Inhibitor
Name:
BDBM50040188
Synonyms:
(cis)Tyr-1-Amino-CycloHexylcarbonyl-Phe-Leu-Arg-Arg-Ile-Arg-Pro-Lys-Leu-Lys-NH2 CHEMBL2369477
Type:
Small organic molecule
Emp. Form.:
C78H132N24O13
Mol. Mass.:
1614.0357
SMILES:
CC[C@H](C)[C@H](NC(=O)[C@H](CCCN=C(N)N)NC(=O)[C@H](CCCN=C(N)N)NC(=O)[C@H](CC(C)C)NC(=O)[C@H](Cc1ccccc1)NC(=O)C1CCC(CC1)NC(=O)[C@@H](N)Cc1ccc(O)cc1)C(=O)N[C@@H](CCCN=C(N)N)C(=O)N1CCC[C@H]1C(=O)N[C@@H](CCCCN)C(=O)N[C@@H](CC(C)C)C(=O)N[C@@H](CCCCN)C(N)=O
: