Target
cGMP-specific 3',5'-cyclic phosphodiesterase
Ligand
BDBM50040377
Substrate
Meas. Tech.
ChEMBL_155378 (CHEMBL760831)
IC50
1000±n/a nM
Citation
 Buckle, DRArch, JRConnolly, BJFenwick, AEFoster, KAMurray, KJReadshaw, SASmallridge, MSmith, DG Inhibition of cyclic nucleotide phosphodiesterase by derivatives of 1,3-bis(cyclopropylmethyl)xanthine. J Med Chem 37:476-85 (1994)  
Target
Name:
cGMP-specific 3',5'-cyclic phosphodiesterase
Synonyms:
3',5'-cyclic phosphodiesterase PDE5 PDE5A_HUMAN Phosphodiesterase 5 (PDE5) Phosphodiesterase 5A (PDE5A) cGMP-specific 3',5'-cyclic phosphodiesterase
Type:
Protein
Mol. Mass.:
99975.83
Organism:
Homo sapiens (Human)
Description:
O76074
Residue:
875
  
Inhibitor
Name:
BDBM50040377
Synonyms:
2-(2-Propoxy-phenyl)-1,7-dihydro-purin-6-one CHEMBL42713 SK-96321
Type:
Small organic molecule
Emp. Form.:
C14H14N4O2
Mol. Mass.:
270.2866
SMILES:
CCCOc1ccccc1-c1nc2nc[nH]c2c(=O)[nH]1
: