Target
cGMP-specific 3',5'-cyclic phosphodiesterase
Ligand
BDBM50040347
Substrate
Meas. Tech.
ChEMBL_155377 (CHEMBL760830)
IC50
37000±n/a nM
Citation
 Buckle, DRArch, JRConnolly, BJFenwick, AEFoster, KAMurray, KJReadshaw, SASmallridge, MSmith, DG Inhibition of cyclic nucleotide phosphodiesterase by derivatives of 1,3-bis(cyclopropylmethyl)xanthine. J Med Chem 37:476-85 (1994)  
Target
Name:
cGMP-specific 3',5'-cyclic phosphodiesterase
Synonyms:
3',5'-cyclic phosphodiesterase PDE5 PDE5A_HUMAN Phosphodiesterase 5 (PDE5) Phosphodiesterase 5A (PDE5A) cGMP-specific 3',5'-cyclic phosphodiesterase
Type:
Protein
Mol. Mass.:
99975.83
Organism:
Homo sapiens (Human)
Description:
O76074
Residue:
875
  
Inhibitor
Name:
BDBM50040347
Synonyms:
CHEMBL142922 | N-[1,3-Bis-cyclopropylmethyl-2,6-dioxo-7-(3,4,5-trimethoxy-benzyl)-2,3,6,7-tetrahydro-1H-purin-8-yl]-4-methoxy-benzenesulfonamide
Type:
Small organic molecule
Emp. Form.:
C30H35N5O8S
Mol. Mass.:
625.693
SMILES:
COc1ccc(cc1)S(=O)(=O)Nc1nc2n(CC3CC3)c(=O)n(CC3CC3)c(=O)c2n1Cc1cc(OC)c(OC)c(OC)c1
: