Target
Adenosine receptor A1
Ligand
BDBM50040344
Substrate
Meas. Tech.
ChEMBL_28668 (CHEMBL649066)
IC50
2700±n/a nM
Citation
 Buckle, DRArch, JRConnolly, BJFenwick, AEFoster, KAMurray, KJReadshaw, SASmallridge, MSmith, DG Inhibition of cyclic nucleotide phosphodiesterase by derivatives of 1,3-bis(cyclopropylmethyl)xanthine. J Med Chem 37:476-85 (1994)  
Target
Name:
Adenosine receptor A1
Synonyms:
AA1R_RAT ADENOSINE A1 high Adenosine A1 receptor (A1) Adenosine receptors A1 | Adora1
Type:
Protein
Mol. Mass.:
36704.13
Organism:
Rattus norvegicus (rat)
Description:
Residue:
326
  
Inhibitor
Name:
BDBM50040344
Synonyms:
8-Amino-1,3-bis-cyclopropylmethyl-7-(propane-2-sulfonyl)-3,7-dihydro-purine-2,6-dione | CHEMBL439809
Type:
Small organic molecule
Emp. Form.:
C16H23N5O4S
Mol. Mass.:
381.45
SMILES:
CC(C)S(=O)(=O)n1c(N)nc2n(CC3CC3)c(=O)n(CC3CC3)c(=O)c12
: