Target
Group 10 secretory phospholipase A2
Ligand
BDBM50004499
Substrate
Meas. Tech.
ChEMBL_156341 (CHEMBL759984)
IC50
30000±n/a nM
Citation
 Beaton, HGBennion, CConnolly, SCook, ARGensmantel, NPHallam, CHardy, KHitchin, BJackson, CGRobinson, DH Discovery of new non-phospholipid inhibitors of the secretory phospholipases A2. J Med Chem 37:557-9 (1994)  
Target
Name:
Group 10 secretory phospholipase A2
Synonyms:
Group X secretory phospholipase A2 PLA2G10
Type:
PROTEIN
Mol. Mass.:
18153.11
Organism:
Homo sapiens (Human)
Description:
ChEMBL_1442449
Residue:
165
  
Inhibitor
Name:
BDBM50004499
Synonyms:
(R)-O-(2-Hexadecanamidoisohexyl) phosphocholine {2-[(2-Hexadecanoyl amino-4-methyl-p entyloxy)-hydroxy-phoryloxy]-ethyl}-trimethyl-ammonium
Type:
Small organic molecule
Emp. Form.:
C27H57N2O5P
Mol. Mass.:
520.7256
SMILES:
CCCCCCCCCCCCCCCC(=O)N[C@@H](COP([O-])(=O)OCC[N+](C)(C)C)CC(C)C
: