Target
Platelet-activating factor acetylhydrolase [136-227]
Ligand
BDBM50040467
Substrate
Meas. Tech.
ChEMBL_156342 (CHEMBL759985)
IC50
1300±n/a nM
Citation
 Beaton, HGBennion, CConnolly, SCook, ARGensmantel, NPHallam, CHardy, KHitchin, BJackson, CGRobinson, DH Discovery of new non-phospholipid inhibitors of the secretory phospholipases A2. J Med Chem 37:557-9 (1994)  
Target
Name:
Platelet-activating factor acetylhydrolase [136-227]
Synonyms:
A0A5G2RFL7_PIG PLA2G7
Type:
PROTEIN
Mol. Mass.:
10360.56
Organism:
Sus scrofa
Description:
ChEMBL_156342
Residue:
92
  
Inhibitor
Name:
BDBM50040467
Synonyms:
(S)-5-((S)-Hexadecanoylamino)-7-methyl-octanoic acid | CHEMBL152115
Type:
Small organic molecule
Emp. Form.:
C25H49NO3
Mol. Mass.:
411.6615
SMILES:
CCCCCCCCCCCCCCCC(=O)N[C@@H](CCCC(O)=O)CC(C)C
: