Target
Genome polyprotein
Ligand
BDBM50040577
Substrate
Meas. Tech.
ChEMBL_158047 (CHEMBL767017)
IC50
235000±n/a nM
Citation
 De Voss, JJSui, ZDeCamp, DLSalto, RBabé, LMCraik, CSOrtiz de Montellano, PR Haloperidol-based irreversible inhibitors of the HIV-1 and HIV-2 proteases. J Med Chem 37:665-73 (1994)  
Target
Name:
Genome polyprotein
Synonyms:
Human rhinovirus A protease | Human rhinovirus B 3A protease
Type:
PROTEIN
Mol. Mass.:
44361.04
Organism:
Human rhinovirus B
Description:
ChEMBL_158953
Residue:
401
  
Inhibitor
Name:
BDBM50040577
Synonyms:
4-(4-Chloro-phenyl)-1-[3-(2-phenyl-oxiranyl)-prop-2-ynyl]-piperidin-4-ol | CHEMBL159049
Type:
Small organic molecule
Emp. Form.:
C22H22ClNO2
Mol. Mass.:
367.869
SMILES:
OC1(CCN(CC#CC2(CO2)c2ccccc2)CC1)c1ccc(Cl)cc1
: