Target
Sphingosine 1-phosphate receptor 3
Ligand
BDBM50494302
Substrate
Meas. Tech.
ChEMBL_1276040 (CHEMBL3088963)
Ki
4880±n/a nM
Citation
 Urbano, MGuerrero, MRosen, HRoberts, E Modulators of the Sphingosine 1-phosphate receptor 1. Bioorg Med Chem Lett 23:6377-89 (2013)  
Target
Name:
Sphingosine 1-phosphate receptor 3
Synonyms:
C9orf108 EDG3 S1P receptor 3 S1P3 S1PR3_HUMAN Sphingosine 1-phosphate receptor 3 (S1P3) | Sphingosine 1-phosphate receptor Edg-3
Type:
G Protein-Coupled Receptor (GPCR)
Mol. Mass.:
42278.13
Organism:
Homo sapiens (Human)
Description:
Q99500
Residue:
378
  
Inhibitor
Name:
BDBM50494302
Synonyms:
CHEMBL3086532
Type:
Small organic molecule
Emp. Form.:
C13H16ClFN4O3S
Mol. Mass.:
362.808
SMILES:
CCn1c(OC)nnc1[C@@H](C)NS(=O)(=O)c1ccc(F)c(Cl)c1
: