Target
Gamma-aminobutyric acid receptor subunit alpha-6/beta-2/gamma-2
Ligand
BDBM50000766
Substrate
Meas. Tech.
ChEMBL_30108 (CHEMBL642035)
Ki
>7000±n/a nM
Citation
 TenBrink, REIm, WBSethy, VHTang, AHCarter, DB Antagonist, partial agonist, and full agonist imidazo[1,5-a]quinoxaline amides and carbamates acting through the GABAA/benzodiazepine receptor. J Med Chem 37:758-68 (1994)  
Target
Name:
Gamma-aminobutyric acid receptor subunit alpha-6/beta-2/gamma-2
Synonyms:
GABA A receptor alpha-6/beta-2/gamma-2 | GABA receptor alpha-6/beta-2/gamma-2 subunit
Type:
Mol. Mass.:
Description:
ASSAY_ID of EBI is 30108
Components:
This complex has 3 components.
Component 1
Name:
Gamma-aminobutyric acid receptor subunit gamma-2
Synonyms:
GABA(A) receptor subunit gamma-2 GBRG2_HUMAN
Type:
PROTEIN
Mol. Mass.:
54172.74
Organism:
Homo sapiens (Human)
Description:
EBI_217
Residue:
467
  
Component 2
Name:
Gamma-aminobutyric acid receptor subunit beta-2
Synonyms:
GABA(A) receptor subunit beta-2 GBRB2_HUMAN
Type:
PROTEIN
Mol. Mass.:
59167.91
Organism:
Homo sapiens (Human)
Description:
EBI_221
Residue:
512
  
Component 3
Name:
Gamma-aminobutyric acid receptor subunit alpha-6
Synonyms:
GABA A alpha6 GABRA6 | GBRA6_HUMAN
Type:
Enzyme Catalytic Domain
Mol. Mass.:
51029.60
Organism:
Homo sapiens (Human)
Description:
GABA A alpha6 0 HUMAN::Q16445
Residue:
453
  
Component 4
Name:
Gamma-aminobutyric acid receptor subunit beta-2
Synonyms:
GABA(A) receptor subunit beta-2 GBRB2_HUMAN
Type:
PROTEIN
Mol. Mass.:
59167.91
Organism:
Homo sapiens (Human)
Description:
EBI_221
Residue:
512
  
Inhibitor
Name:
BDBM50000766
Synonyms:
CHEMBL12 US9271961, Diazepam
Type:
Small organic molecule
Emp. Form.:
C16H13ClN2O
Mol. Mass.:
284.74
SMILES:
CN1c2ccc(Cl)cc2C(=NCC1=O)c1ccccc1
: