Target
Integrin alpha-IIb/beta-3
Ligand
BDBM50040752
Substrate
Meas. Tech.
ChEMBL_70314 (CHEMBL678019)
Ki
9.3±n/a nM
Citation
 Ali, FEBennett, DBCalvo, RRElliott, JDHwang, SMKu, TWLago, MANichols, AJRomoff, TTShah, DH Conformationally constrained peptides and semipeptides derived from RGD as potent inhibitors of the platelet fibrinogen receptor and platelet aggregation. J Med Chem 37:769-80 (1994)  
Target
Name:
Integrin alpha-IIb/beta-3
Synonyms:
Glycoprotein IIb/IIIa
Type:
Mol. Mass.:
Description:
ASSAY_ID of EBI is 30109
Components:
This complex has 2 components.
Component 1
Name:
Integrin beta-3
Synonyms:
CD_antigen=CD61 GPIIIa ITGB3 Platelet membrane glycoprotein IIIa
Type:
Protein
Mol. Mass.:
87038.91
Organism:
Homo sapiens (Human)
Description:
P05106
Residue:
788
  
Component 2
Name:
Integrin alpha-IIb
Synonyms:
CD_antigen=CD41 GPIIb Glycoprotein IIb ITGA2B Integrin alpha-IIb heavy chain Integrin alpha-IIb light chain, form 2 Integrin alpha-V/beta-3 and alpha-IIb/beta 3 | Platelet membrane glycoprotein IIb
Type:
Protein
Mol. Mass.:
113354.85
Organism:
Homo sapiens (Human)
Description:
P08514
Residue:
1039
  
Inhibitor
Name:
BDBM50040752
Synonyms:
CHEMBL2371457 | [(7S,13S,16R)-16-Amino-4-carbamoyl-13-(3-guanidino-propyl)-3,3,14-trimethyl-6,9,12,15-tetraoxo-1,2-dithia-5,8,11,14-tetraaza-cycloheptadec-7-yl]-acetic acid
Type:
Small organic molecule
Emp. Form.:
C21H37N9O7S2
Mol. Mass.:
591.705
SMILES:
[#6]-[#7]-1-[#6@@H](-[#6]-[#6]-[#6]\[#7]=[#6](/[#7])-[#7])-[#6](=O)-[#7]-[#6]-[#6](=O)-[#7]-[#6@@H](-[#6]-[#6](-[#8])=O)-[#6](=O)-[#7]-[#6@@H](-[#6](-[#7])=O)C([#6])([#6])[#16]-[#16]-[#6]-[#6@H](-[#7])-[#6]-1=O
: