Target
Integrin alpha-IIb/beta-3
Ligand
BDBM50010174
Substrate
Meas. Tech.
ChEMBL_70314 (CHEMBL678019)
Ki
4200±n/a nM
Citation
 Ali, FEBennett, DBCalvo, RRElliott, JDHwang, SMKu, TWLago, MANichols, AJRomoff, TTShah, DH Conformationally constrained peptides and semipeptides derived from RGD as potent inhibitors of the platelet fibrinogen receptor and platelet aggregation. J Med Chem 37:769-80 (1994)  
Target
Name:
Integrin alpha-IIb/beta-3
Synonyms:
Glycoprotein IIb/IIIa
Type:
Mol. Mass.:
Description:
ASSAY_ID of EBI is 30109
Components:
This complex has 2 components.
Component 1
Name:
Integrin beta-3
Synonyms:
CD_antigen=CD61 GPIIIa ITGB3 Platelet membrane glycoprotein IIIa
Type:
Protein
Mol. Mass.:
87038.91
Organism:
Homo sapiens (Human)
Description:
P05106
Residue:
788
  
Component 2
Name:
Integrin alpha-IIb
Synonyms:
CD_antigen=CD41 GPIIb Glycoprotein IIb ITGA2B Integrin alpha-IIb heavy chain Integrin alpha-IIb light chain, form 2 Integrin alpha-V/beta-3 and alpha-IIb/beta 3 | Platelet membrane glycoprotein IIb
Type:
Protein
Mol. Mass.:
113354.85
Organism:
Homo sapiens (Human)
Description:
P08514
Residue:
1039
  
Inhibitor
Name:
BDBM50010174
Synonyms:
3-[4-amino(imino)methylamino-1-methylcarboxamido-(1S)-butylcarboxamidomethylcarboxamido]-3-carbamoylpropanoic acid CHEMBL104534
Type:
Small organic molecule
Emp. Form.:
C14H25N7O6
Mol. Mass.:
387.3916
SMILES:
CC(=O)N[C@@H](CCCNC(N)=N)C(=O)NCC(=O)N[C@@H](CC(O)=O)C(N)=O
: