Target
Integrin alpha-IIb/beta-3
Ligand
BDBM50040737
Substrate
Meas. Tech.
ChEMBL_70314 (CHEMBL678019)
Ki
2.1±n/a nM
Citation
 Ali, FEBennett, DBCalvo, RRElliott, JDHwang, SMKu, TWLago, MANichols, AJRomoff, TTShah, DH Conformationally constrained peptides and semipeptides derived from RGD as potent inhibitors of the platelet fibrinogen receptor and platelet aggregation. J Med Chem 37:769-80 (1994)  
Target
Name:
Integrin alpha-IIb/beta-3
Synonyms:
Glycoprotein IIb/IIIa
Type:
Mol. Mass.:
Description:
ASSAY_ID of EBI is 30109
Components:
This complex has 2 components.
Component 1
Name:
Integrin beta-3
Synonyms:
CD_antigen=CD61 GPIIIa ITGB3 Platelet membrane glycoprotein IIIa
Type:
Protein
Mol. Mass.:
87038.91
Organism:
Homo sapiens (Human)
Description:
P05106
Residue:
788
  
Component 2
Name:
Integrin alpha-IIb
Synonyms:
CD_antigen=CD41 GPIIb Glycoprotein IIb ITGA2B Integrin alpha-IIb heavy chain Integrin alpha-IIb light chain, form 2 Integrin alpha-V/beta-3 and alpha-IIb/beta 3 | Platelet membrane glycoprotein IIb
Type:
Protein
Mol. Mass.:
113354.85
Organism:
Homo sapiens (Human)
Description:
P08514
Residue:
1039
  
Inhibitor
Name:
BDBM50040737
Synonyms:
CHEMBL165266 | [(7R,13R)-13-(3-Guanidino-propyl)-14-methyl-6,9,12,15-tetraoxo-6,7,8,9,10,11,12,13,14,15-decahydro-5H-20,21-dithia-5,8,11,14-tetraaza-dibenzo[a,e]cycloheptadecen-7-yl]-acetic acid
Type:
Small organic molecule
Emp. Form.:
C26H31N7O6S2
Mol. Mass.:
601.698
SMILES:
CN1[C@H](CCCNC(N)=N)C(=O)NCC(=O)N[C@H](CC(O)=O)C(=O)Nc2ccccc2SSc2ccccc2C1=O
: