Target
Thymidylate synthase
Ligand
BDBM50040861
Substrate
Meas. Tech.
ChEMBL_209643 (CHEMBL811584)
Ki
0.09±n/a nM
Citation
 Pendergast, WDickerson, SHDev, IKFerone, RDuch, DSSmith, GK Benzo[f]quinazoline inhibitors of thymidylate synthase: methyleneamino-linked aroylglutamate derivatives. J Med Chem 37:838-44 (1994)  
Target
Name:
Thymidylate synthase
Synonyms:
TS TYMS Thymidylate synthase (TS) | Thymidylate synthase/GAR transformylase/AICAR transformylase
Type:
Enzyme
Mol. Mass.:
35718.07
Organism:
Homo sapiens (Human)
Description:
Residue:
313
  
Inhibitor
Name:
BDBM50040861
Synonyms:
(S)-2-(5-(((1,2-DIHYDRO-3-METHYL-1-OXOBENZO(F)QUINAZOLIN-9-YL)METHYL)AMINO)1-OXO-2-ISOINDOLINYL)GLUTARIC ACID CHEMBL169896 TCMDC-131928
Type:
Small organic molecule
Emp. Form.:
C27H24N4O6
Mol. Mass.:
500.5027
SMILES:
Cc1nc2ccc3ccc(CNc4ccc5C(=O)N(Cc5c4)[C@@H](CCC(O)=O)C(O)=O)cc3c2c(=O)[nH]1
: