Target
Thymidylate synthase
Ligand
BDBM50040864
Substrate
Meas. Tech.
ChEMBL_209644 (CHEMBL811585)
Ki
22±n/a nM
Citation
 Pendergast, WDickerson, SHDev, IKFerone, RDuch, DSSmith, GK Benzo[f]quinazoline inhibitors of thymidylate synthase: methyleneamino-linked aroylglutamate derivatives. J Med Chem 37:838-44 (1994)  
Target
Name:
Thymidylate synthase
Synonyms:
TS TYMS Thymidylate synthase (TS) | Thymidylate synthase/GAR transformylase/AICAR transformylase
Type:
Enzyme
Mol. Mass.:
35718.07
Organism:
Homo sapiens (Human)
Description:
Residue:
313
  
Inhibitor
Name:
BDBM50040864
Synonyms:
(S)-2-{4-[Methyl-(3-methyl-1-oxo-1,2-dihydro-benzo[f]quinazolin-9-ylmethyl)-amino]-benzoylamino}-pentanedioic acid TCMDC-138089
Type:
Small organic molecule
Emp. Form.:
C27H26N4O6
Mol. Mass.:
502.5185
SMILES:
CN(Cc1ccc2ccc3nc(C)[nH]c(=O)c3c2c1)c1ccc(cc1)C(=O)N[C@@H](CCC(O)=O)C(O)=O
: