Target
Muscarinic acetylcholine receptor M3
Ligand
BDBM50066861
Substrate
Meas. Tech.
ChEMBL_1278636 (CHEMBL3095624)
Ki
0.010000±n/a nM
Citation
 Tautermann, CSKiechle, TSeeliger, DDiehl, SWex, EBanholzer, RGantner, FPieper, MPCasarosa, P Molecular basis for the long duration of action and kinetic selectivity of tiotropium for the muscarinic M3 receptor. J Med Chem 56:8746-56 (2013)  
Target
Name:
Muscarinic acetylcholine receptor M3
Synonyms:
ACM3_HUMAN Cholinergic, muscarinic M3 Muscarinic receptor M3 | RecName: Full=Muscarinic acetylcholine receptor M3
Type:
Enzyme
Mol. Mass.:
66151.03
Organism:
Homo sapiens (Human)
Description:
P20309
Residue:
590
  
Inhibitor
Name:
BDBM50066861
Synonyms:
BA-679-BR Tiotropium Bromide | Tiotropium Bromide Monohydrate
Type:
Small organic molecule
Emp. Form.:
C19H24BrNO5S2
Mol. Mass.:
490.432
SMILES:
O.[Br-].[H][C@]12O[C@@]1([H])[C@]1([H])C[C@@]([H])(C[C@@]2([H])[N+]1(C)C)OC(=O)C(O)(c1cccs1)c1cccs1
: