Target
D(2) dopamine receptor
Ligand
BDBM50007568
Substrate
Meas. Tech.
ChEMBL_58692 (CHEMBL672658)
IC50
1.3±n/a nM
Citation
 Andersen, KLiljefors, TGundertofte, KPerregaard, JBøgesø, KP Development of a receptor-interaction model for serotonin 5-HT2 receptor antagonists. Predicting selectivity with respect to dopamine D2 receptors. J Med Chem 37:950-62 (1994)  
Target
Name:
D(2) dopamine receptor
Synonyms:
DOPAMINE D2 DOPAMINE D2 Short Dopamine D2 receptor Drd2
Type:
G Protein-Coupled Receptor (GPCR)
Mol. Mass.:
50931.60
Organism:
Rattus norvegicus (rat)
Description:
P61169
Residue:
444
  
Inhibitor
Name:
BDBM50007568
Synonyms:
1-((S)-8-Chloro-10,11-dihydro-dibenzo[b,f]thiepin-10-yl)-4-methyl-piperazine CHEMBL303313 | OCTOCLOTHEPIN-S
Type:
Small organic molecule
Emp. Form.:
C19H21ClN2S
Mol. Mass.:
344.901
SMILES:
CN1CCN(CC1)[C@H]1Cc2ccccc2Sc2ccc(Cl)cc12
: