Target
D(2) dopamine receptor
Ligand
BDBM50001811
Substrate
Meas. Tech.
ChEMBL_58692 (CHEMBL672658)
IC50
280±n/a nM
Citation
 Andersen, KLiljefors, TGundertofte, KPerregaard, JBøgesø, KP Development of a receptor-interaction model for serotonin 5-HT2 receptor antagonists. Predicting selectivity with respect to dopamine D2 receptors. J Med Chem 37:950-62 (1994)  
Target
Name:
D(2) dopamine receptor
Synonyms:
DOPAMINE D2 DOPAMINE D2 Short Dopamine D2 receptor Drd2
Type:
G Protein-Coupled Receptor (GPCR)
Mol. Mass.:
50931.60
Organism:
Rattus norvegicus (rat)
Description:
P61169
Residue:
444
  
Inhibitor
Name:
BDBM50001811
Synonyms:
1-(2-{4-[3-(4-Fluoro-phenyl)-5-methyl-indol-1-yl]-3,6-dihydro-2H-pyridin-1-yl}-ethyl)-imidazolidin-2-one | CHEMBL343034
Type:
Small organic molecule
Emp. Form.:
C25H27FN4O
Mol. Mass.:
418.5065
SMILES:
Cc1ccc2n(cc(-c3ccc(F)cc3)c2c1)C1=CCN(CCN2CCNC2=O)CC1
: