Target
Protein kinase C alpha type
Ligand
BDBM50041389
Substrate
Meas. Tech.
ChEMBL_162229 (CHEMBL770293)
Ki
0.78±n/a nM
Citation
 Wang, SMilne, GWNicklaus, MCMarquez, VELee, JBlumberg, PM Protein kinase C. Modeling of the binding site and prediction of binding constants. J Med Chem 37:1326-38 (1994)  
Target
Name:
Protein kinase C alpha type
Synonyms:
KPCA_HUMAN PKC alpha and beta-2 PKC-alpha PRKACA Protein Kinase C- alpha Protein kinase C alpha (PKCa) Protein kinase C alpha type (PRKCA) RAF proto-oncogene serine/threonine-protein kinase
Type:
Enzyme
Mol. Mass.:
76755.65
Organism:
Homo sapiens (Human)
Description:
The recombinant human PKC enzymes were produced using a baculovirus expression system in SF9 cells
Residue:
672
  
Inhibitor
Name:
BDBM50041389
Synonyms:
Butyric acid (1aR,4aR,7aS,7bS,8R,9R,9aS)-9-butyryloxy-4a,7b-dihydroxy-3-hydroxymethyl-1,1,6,8-tetramethyl-5-oxo-1,1a,1b,4,4a,5,7a,7b,8,9-decahydro-cyclopropa[3,4]benzo[1,2-e]azulen-9a-yl ester | CHEMBL28433
Type:
Small organic molecule
Emp. Form.:
C28H40O8
Mol. Mass.:
504.6124
SMILES:
CCCC(=O)O[C@@H]1[C@@H](C)[C@]2(O)[C@@H]3C=C(C)C(=O)[C@@]3(O)CC(CO)=CC2[C@@H]2C(C)(C)[C@]12OC(=O)CCC
: