Target
Glutamate receptor ionotropic, NMDA 1
Ligand
BDBM50041465
Substrate
Meas. Tech.
ChEMBL_140307 (CHEMBL749365)
IC50
4.5±n/a nM
Citation
 Kulagowski, JJBaker, RCurtis, NRLeeson, PDMawer, IMMoseley, AMRidgill, MPRowley, MStansfield, IFoster, AC 3'-(Arylmethyl)- and 3'-(aryloxy)-3-phenyl-4-hydroxyquinolin-2(1H)-ones: orally active antagonists of the glycine site on the NMDA receptor. J Med Chem 37:1402-5 (1994)  
Target
Name:
Glutamate receptor ionotropic, NMDA 1
Synonyms:
Glutamate (NMDA) receptor subunit zeta 1 Glutamate-NMDA-Channel Glutamate-NMDA-Polyamine NMDA Nmdar1 | phencyclidine
Type:
Enzyme Catalytic Domain
Mol. Mass.:
105533.40
Organism:
RAT
Description:
P35439
Residue:
938
  
Inhibitor
Name:
BDBM50041465
Synonyms:
7-Chloro-4-hydroxy-3-[3-(4-methoxy-benzyl)-phenyl]-1H-quinolin-2-one CHEMBL31049
Type:
Small organic molecule
Emp. Form.:
C23H18ClNO3
Mol. Mass.:
391.847
SMILES:
COc1ccc(Cc2cccc(c2)-c2c(O)c3ccc(Cl)cc3[nH]c2=O)cc1
: