Target
Endothelin-1 receptor
Ligand
BDBM50041616
Substrate
Meas. Tech.
ChEMBL_65650 (CHEMBL678070)
Ki
11.3±n/a nM
Citation
 Elliott, JDLago, MACousins, RDGao, ALeber, JDErhard, KFNambi, PElshourbagy, NAKumar, CLee, JA 1,3-Diarylindan-2-carboxylic acids, potent and selective non-peptide endothelin receptor antagonists. J Med Chem 37:1553-7 (1994)  
Target
Name:
Endothelin-1 receptor
Synonyms:
EDNRA ET-A ETA-R Endothelin receptor type A hET-AR
Type:
Enzyme Catalytic Domain
Mol. Mass.:
48736.88
Organism:
Homo sapiens (Human)
Description:
P25101
Residue:
427
  
Inhibitor
Name:
BDBM50041616
Synonyms:
(1S,2S,3R)-1-Benzo[1,3]dioxol-5-yl-3-(4-methoxy-phenyl)-5-propoxy-indan-2-carboxylic acid | CHEMBL39142
Type:
Small organic molecule
Emp. Form.:
C27H26O6
Mol. Mass.:
446.4917
SMILES:
CCCOc1ccc2[C@@H]([C@H]([C@@H](c2c1)c1ccc(OC)cc1)C(O)=O)c1ccc2OCOc2c1
: