Target
Endothelin receptor type B
Ligand
BDBM50041621
Substrate
Meas. Tech.
ChEMBL_63849 (CHEMBL673233)
Ki
2443±n/a nM
Citation
 Elliott, JDLago, MACousins, RDGao, ALeber, JDErhard, KFNambi, PElshourbagy, NAKumar, CLee, JA 1,3-Diarylindan-2-carboxylic acids, potent and selective non-peptide endothelin receptor antagonists. J Med Chem 37:1553-7 (1994)  
Target
Name:
Endothelin receptor type B
Synonyms:
EDNRB ENDOTHELIN B ETRB Endothelin receptor non-selective type | Endothelin receptor, ET-A/ET-B
Type:
Enzyme Catalytic Domain
Mol. Mass.:
49664.00
Organism:
Homo sapiens (Human)
Description:
ENDOTHELIN B EDNRB HUMAN::P24530
Residue:
442
  
Inhibitor
Name:
BDBM50041621
Synonyms:
(1R,2R,3S)-1,3-Bis-(4-methoxy-phenyl)-indan-2-carboxylic acid | CHEMBL290026
Type:
Small organic molecule
Emp. Form.:
C24H22O4
Mol. Mass.:
374.4291
SMILES:
COc1ccc(cc1)[C@H]1[C@@H]([C@H](c2ccccc12)c1ccc(OC)cc1)C(O)=O
: