Target
Endothelin receptor type B
Ligand
BDBM50041619
Substrate
Meas. Tech.
ChEMBL_63849 (CHEMBL673233)
Ki
>30000±n/a nM
Citation
 Elliott, JDLago, MACousins, RDGao, ALeber, JDErhard, KFNambi, PElshourbagy, NAKumar, CLee, JA 1,3-Diarylindan-2-carboxylic acids, potent and selective non-peptide endothelin receptor antagonists. J Med Chem 37:1553-7 (1994)  
Target
Name:
Endothelin receptor type B
Synonyms:
EDNRB ENDOTHELIN B ETRB Endothelin receptor non-selective type | Endothelin receptor, ET-A/ET-B
Type:
Enzyme Catalytic Domain
Mol. Mass.:
49664.00
Organism:
Homo sapiens (Human)
Description:
ENDOTHELIN B EDNRB HUMAN::P24530
Residue:
442
  
Inhibitor
Name:
BDBM50041619
Synonyms:
(1S,2S,3R)-1-(4-Methoxy-phenyl)-3-phenyl-indan-2-carboxylic acid | CHEMBL39057
Type:
Small organic molecule
Emp. Form.:
C23H20O3
Mol. Mass.:
344.4031
SMILES:
COc1ccc(cc1)[C@@H]1[C@H]([C@@H](c2ccccc12)c1ccccc1)C(O)=O
: