Target
Cholecystokinin receptor type A
Ligand
BDBM50041633
Substrate
Meas. Tech.
ChEMBL_49582 (CHEMBL661235)
IC50
84±n/a nM
Citation
 Elliott, RLKopecka, HTufano, MDShue, YKGauri, AJLin, CWBianchi, BRMiller, TRWitte, DGStashko, MA Novel Asp32-replacement tetrapeptide analogues as potent and selective CCK-A agonists. J Med Chem 37:1562-8 (1994)  
Target
Name:
Cholecystokinin receptor type A
Synonyms:
CCK-A receptor CCK1-R CCKAR_CAVPO Cholecystokinin receptor type A | Cholecystokinin-1 receptor
Type:
Mol. Mass.:
48229.77
Organism:
Cavia porcellus
Description:
Residue:
430
  
Inhibitor
Name:
BDBM50041633
Synonyms:
CHEMBL431912 | [1-[(S)-1-({[(1-Carbamoyl-2-phenyl-ethyl)-methyl-carbamoyl]-methyl}-methyl-carbamoyl)-5-(3-o-tolyl-ureido)-pentylcarbamoyl]-2-(1H-indol-3-yl)-ethyl]-carbamic acid tert-butyl ester
Type:
Small organic molecule
Emp. Form.:
C43H56N8O7
Mol. Mass.:
796.9541
SMILES:
CN(CC(=O)N(C)C(Cc1ccccc1)C(N)=O)C(=O)[C@H](CCCCNC(=O)Nc1ccccc1C)NC(=O)C(Cc1c[nH]c2ccccc12)NC(=O)OC(C)(C)C
: