Target
Replicase polyprotein 1ab
Ligand
BDBM50495003
Substrate
Meas. Tech.
ChEMBL_1282952 (CHEMBL3102681)
IC50
10070±n/a nM
Citation
 Liu, WZhu, HMNiu, GJShi, EZChen, JSun, BChen, WQZhou, HGYang, C Synthesis, modification and docking studies of 5-sulfonyl isatin derivatives as SARS-CoV 3C-like protease inhibitors. Bioorg Med Chem 22:292-302 (2014)  
Target
Name:
Replicase polyprotein 1ab
Synonyms:
3C-like proteinase 3C-like proteinase (SARS-CoV 3Cpro) 3CLp GFL Guanine-N7 methyltransferase Helicase Leader protein Non-structural protein 10 Non-structural protein 3 Non-structural protein 6 Non-structural protein 8 ORF1ab polyprotein PL2-PRO Pol R1AB_SARS RdRp SARS coronavirus main proteinase nsp1 nsp12 nsp14 nsp16 nsp3 nsp5 nsp7 nsp9 pp1ab | rep
Type:
Protein
Mol. Mass.:
790250.81
Organism:
Human SARS coronavirus (SARS-CoV) (Severe acute respiratory syndrome coronavirus)
Description:
P0C6X7
Residue:
7073
  
Inhibitor
Name:
BDBM50495003
Synonyms:
CHEMBL3099539 | acs.jmedchem.1c00409_ST.516
Type:
Small organic molecule
Emp. Form.:
C17H15N3O6S
Mol. Mass.:
389.383
SMILES:
O=C(N1CCN(CC1)S(=O)(=O)c1ccc2NC(=O)C(=O)c2c1)c1ccco1
: