Target
Gag-Pol polyprotein [489-587]
Ligand
BDBM50041950
Substrate
Meas. Tech.
ChEBML_158994
IC50
540±n/a nM
Citation
 Wonacott, ACooke, RHayes, FRHann, MMJhoti, HMcMeekin, PMistry, AMurray-Rust, PSingh, OMWeir, MP A series of penicillin-derived C2-symmetric inhibitors of HIV-1 proteinase: structural and modeling studies. J Med Chem 36:3113-9 (1993)  
Target
Name:
Gag-Pol polyprotein [489-587]
Synonyms:
Human immunodeficiency virus type 1 protease Pol polyprotein | gag-pol
Type:
Enzyme Subunit
Mol. Mass.:
10781.16
Organism:
Human immunodeficiency virus type 1
Description:
P04585[489-587]
Residue:
99
  
Inhibitor
Name:
BDBM50041950
Synonyms:
1N-benzyl-2-[4-{3-[2-benzylcarbamoyl(benzylcarboxamido)methyl-5,5-dimethyl-(2R,4S)-1,3-thiazolan-4-ylcarboxamido]propylcarbamoyl}-3,5,5-trimethyl-(2S,4S)-tetrahydro-2-thiophenyl]-2-benzylcarboxamidoacetamide | CHEMBL104509
Type:
Small organic molecule
Emp. Form.:
C49H60N8O6S2
Mol. Mass.:
921.181
SMILES:
CC1(C)S[C@@H](NC1C(=O)NCCCNC(=O)[C@@H]1N[C@H](SC1(C)C)[C@H](NC(=O)Cc1ccccc1)C(=O)NCc1ccccc1)[C@H](NC(=O)Cc1ccccc1)C(=O)NCc1ccccc1
: