Target
Replicase polyprotein 1ab
Ligand
BDBM50495211
Substrate
Meas. Tech.
ChEMBL_1284696 (CHEMBL3107396)
IC50
28300±n/a nM
Citation
 Lee, HMittal, APatel, KGatuz, JLTruong, LTorres, JMulhearn, DCJohnson, ME Identification of novel drug scaffolds for inhibition of SARS-CoV 3-Chymotrypsin-like protease using virtual and high-throughput screenings. Bioorg Med Chem 22:167-77 (2014)  
Target
Name:
Replicase polyprotein 1ab
Synonyms:
3C-like proteinase 3C-like proteinase (SARS-CoV 3Cpro) 3CLp GFL Guanine-N7 methyltransferase Helicase Leader protein Non-structural protein 10 Non-structural protein 3 Non-structural protein 6 Non-structural protein 8 ORF1ab polyprotein PL2-PRO Pol R1AB_SARS RdRp SARS coronavirus main proteinase nsp1 nsp12 nsp14 nsp16 nsp3 nsp5 nsp7 nsp9 pp1ab | rep
Type:
Protein
Mol. Mass.:
790250.81
Organism:
Human SARS coronavirus (SARS-CoV) (Severe acute respiratory syndrome coronavirus)
Description:
P0C6X7
Residue:
7073
  
Inhibitor
Name:
BDBM50495211
Synonyms:
CHEMBL3105075
Type:
Small organic molecule
Emp. Form.:
C35H37N2
Mol. Mass.:
485.6811
SMILES:
C(\C=C\c1ccccc1)[N+]1(C\C=C\c2ccccc2)CCN(CC1)C(c1ccccc1)c1ccccc1
: