Target
Leukotriene B4 receptor 1
Ligand
BDBM50042156
Substrate
Meas. Tech.
ChEBML_153299
Ki
72.0±n/a nM
Citation
 Daines, RAChambers, PAPendrak, IJakas, DRSarau, HMFoley, JJSchmidt, DBKingsbury, WD Trisubstituted pyridine leukotriene B4 receptor antagonists: synthesis and structure-activity relationships. J Med Chem 36:3321-32 (1993)  
Target
Name:
Leukotriene B4 receptor 1
Synonyms:
BLT BLTR Chemoattractant receptor-like 1 GPR16 LTB4-R 1 Leukotriene B4 R1 Leukotriene B4 receptor 1 P2Y purinoceptor 7 | P2Y7
Type:
Enzyme Catalytic Domain
Mol. Mass.:
37582.68
Organism:
Homo sapiens (Human)
Description:
Q15722
Residue:
352
  
Inhibitor
Name:
BDBM50042156
Synonyms:
3-{3-[8-(4-Methoxy-phenyl)-octyloxy]-6-[3-(oxalyl-amino)-phenylsulfanylmethyl]-pyridin-2-yl}-acrylic acid | CHEMBL334267
Type:
Small organic molecule
Emp. Form.:
C32H36N2O7S
Mol. Mass.:
592.702
SMILES:
COc1ccc(CCCCCCCCOc2ccc(CSc3cccc(NC(=O)C(O)=O)c3)nc2\C=C\C(O)=O)cc1
: